登录 用户中心() [退出] 后台管理 注册
   
您的位置: 首页 首页 >> SoftHub关联区 >> SoftHub关联区 >> 主题: [asd/Android Studio]快速解决 org.gradle.api.tasks.TaskExecutionException: Execution failed for task ':app:compileJava'    [最新]
[asd/Android Studio]快速解决 org.gradle.api.tasks.TaskExecutionException: Execution failed for task ':app:compileJava'
clq
浏览(0) - 2019-03-15 13:14:45 发表 编辑

关键字: android studio

[2019-03-15 13:15:32 最后更新]

快速解决 org.gradle.api.tasks.TaskExecutionException: Execution failed for task ':app:compileJava'

https://www.jianshu.com/p/e83b2aa15965

---------------------------------

asd 有时候并未给出具体的出错位置,这时需要另外做些处理查看具体的位置. 关键点如下:

gradlew compileDebugSource --stacktrace -info
在AndroidStudio的terminal中输入上面的命令,重新编译查看gradle的具体报错信息
运行如上命令后:...

--------------------------------

快速解决 org.gradle.api.tasks.TaskExecutionException: Execution failed for task ':app:compileJava'






MrQ_Android

关注




0.2


2018.08.20 19:49
字数 333
阅读 26638评论 6喜欢 9








前言

CSDN博客地址
GitHub https://github.com/MrQ-Android

开发中遇到的问题

gradle编译出现org.gradle.api.tasks.TaskExecutionException: Execution failed for task ':app:compileJava'

如果你也遇到了相同的问题,有望在1分钟之内找到问题所在,往下读吧
如图:





错误图






错误图详情

也可以点开详细信息
org.gradle.api.tasks.TaskExecutionException: Execution failed for task ':front-core:compileJava'.
at org.gradle.api.internal.tasks.execution.ExecuteActionsTaskExecuter.executeActions(ExecuteActionsTaskExecuter.java:100)
at org.gradle.api.internal.tasks.execution.ExecuteActionsTaskExecuter.execute(ExecuteActionsTaskExecuter.java:70)
at org.gradle.api.internal.tasks.execution.OutputDirectoryCreatingTaskExecuter.execute(OutputDirectoryCreatingTaskExecuter.java:51)
at org.gradle.api.internal.tasks.execution.SkipUpToDateTaskExecuter.execute(SkipUpToDateTaskExecuter.java:62)
at org.gradle.api.internal.tasks.execution.ResolveTaskOutputCachingStateExecuter.execute(ResolveTaskOutputCachingStateExecuter.java:54)
at org.gradle.api.internal.tasks.execution.ValidatingTaskExecuter.execute(ValidatingTaskExecuter.java:60)
at org.gradle.api.internal.tasks.execution.SkipEmptySourceFilesTaskExecuter.execute(SkipEmptySourceFilesTaskExecuter.java:97)
at org.gradle.api.internal.tasks.execution.CleanupStaleOutputsExecuter.execute(CleanupStaleOutputsExecuter.java:87)
at org.gradle.api.internal.tasks.execution.ResolveTaskArtifactStateTaskExecuter.execute(ResolveTaskArtifactStateTaskExecuter.java:52)
at org.gradle.api.internal.tasks.execution.SkipTaskWithNoActionsExecuter.execute(SkipTaskWithNoActionsExecuter.java:52)
at org.gradle.api.internal.tasks.execution.SkipOnlyIfTaskExecuter.execute(SkipOnlyIfTaskExecuter.java:54)
at org.gradle.api.internal.tasks.execution.ExecuteAtMostOnceTaskExecuter.execute(ExecuteAtMostOnceTaskExecuter.java:43)
at org.gradle.api.internal.tasks.execution.CatchExceptionTaskExecuter.execute(CatchExceptionTaskExecuter.java:34)
at org.gradle.execution.taskgraph.DefaultTaskGraphExecuter$EventFiringTaskWorker$1.run(DefaultTaskGraphExecuter.java:248)
at org.gradle.internal.progress.DefaultBuildOperationExecutor$RunnableBuildOperationWorker.execute(DefaultBuildOperationExecutor.java:336)
at org.gradle.internal.progress.DefaultBuildOperationExecutor$RunnableBuildOperationWorker.execute(DefaultBuildOperationExecutor.java:328)
at org.gradle.internal.progress.DefaultBuildOperationExecutor.execute(DefaultBuildOperationExecutor.java:199)
at org.gradle.internal.progress.DefaultBuildOperationExecutor.run(DefaultBuildOperationExecutor.java:110)
at org.gradle.execution.taskgraph.DefaultTaskGraphExecuter$EventFiringTaskWorker.execute(DefaultTaskGraphExecuter.java:241)
at org.gradle.execution.taskgraph.DefaultTaskGraphExecuter$EventFiringTaskWorker.execute(DefaultTaskGraphExecuter.java:230)
at org.gradle.execution.taskgraph.DefaultTaskPlanExecutor$TaskExecutorWorker.processTask(DefaultTaskPlanExecutor.java:123)
at org.gradle.execution.taskgraph.DefaultTaskPlanExecutor$TaskExecutorWorker.access$200(DefaultTaskPlanExecutor.java:79)
at org.gradle.execution.taskgraph.DefaultTaskPlanExecutor$TaskExecutorWorker$1.execute(DefaultTaskPlanExecutor.java:104)
at org.gradle.execution.taskgraph.DefaultTaskPlanExecutor$TaskExecutorWorker$1.execute(DefaultTaskPlanExecutor.java:98)
at org.gradle.execution.taskgraph.DefaultTaskExecutionPlan.execute(DefaultTaskExecutionPlan.java:626)
at org.gradle.execution.taskgraph.DefaultTaskExecutionPlan.executeWithTask(DefaultTaskExecutionPlan.java:581)
at org.gradle.execution.taskgraph.DefaultTaskPlanExecutor$TaskExecutorWorker.run(DefaultTaskPlanExecutor.java:98)
at org.gradle.internal.concurrent.ExecutorPolicy$CatchAndRecordFailures.onExecute(ExecutorPolicy.java:63)
at org.gradle.internal.concurrent.ManagedExecutorImpl$1.run(ManagedExecutorImpl.java:46)
at java.util.concurrent.ThreadPoolExecutor.runWorker(ThreadPoolExecutor.java:1142)
at java.util.concurrent.ThreadPoolExecutor$Worker.run(ThreadPoolExecutor.java:617)
at org.gradle.internal.concurrent.ThreadFactoryImpl$ManagedThreadRunnable.run(ThreadFactoryImpl.java:55)
at java.lang.Thread.run(Thread.java:745)
Caused by: org.gradle.api.internal.tasks.compile.CompilationFailedException: Compilation failed; see the compiler error output for details.
at org.gradle.api.internal.tasks.compile.JdkJavaCompiler.execute(JdkJavaCompiler.java:50)
at org.gradle.api.internal.tasks.compile.JdkJavaCompiler.execute(JdkJavaCompiler.java:35)
at org.gradle.api.internal.tasks.compile.NormalizingJavaCompiler.delegateAndHandleErrors(NormalizingJavaCompiler.java:98)
at org.gradle.api.internal.tasks.compile.NormalizingJavaCompiler.execute(NormalizingJavaCompiler.java:51)
at org.gradle.api.internal.tasks.compile.NormalizingJavaCompiler.execute(NormalizingJavaCompiler.java:37)
at org.gradle.api.internal.tasks.compile.CleaningJavaCompilerSupport.execute(CleaningJavaCompilerSupport.java:35)
at org.gradle.api.internal.tasks.compile.CleaningJavaCompilerSupport.execute(CleaningJavaCompilerSupport.java:25)
at org.gradle.api.tasks.compile.JavaCompile.performCompilation(JavaCompile.java:207)
at org.gradle.api.tasks.compile.JavaCompile.compile(JavaCompile.java:192)
at org.gradle.api.tasks.compile.JavaCompile.compile(JavaCompile.java:124)
at sun.reflect.GeneratedMethodAccessor780.invoke(Unknown Source)
at sun.reflect.DelegatingMethodAccessorImpl.invoke(DelegatingMethodAccessorImpl.java:43)
at java.lang.reflect.Method.invoke(Method.java:498)
at org.gradle.internal.reflect.JavaMethod.invoke(JavaMethod.java:73)
at org.gradle.api.internal.project.taskfactory.IncrementalTaskAction.doExecute(IncrementalTaskAction.java:46)
at org.gradle.api.internal.project.taskfactory.StandardTaskAction.execute(StandardTaskAction.java:39)
at org.gradle.api.internal.project.taskfactory.StandardTaskAction.execute(StandardTaskAction.java:26)
at org.gradle.api.internal.tasks.execution.ExecuteActionsTaskExecuter$1.run(ExecuteActionsTaskExecuter.java:121)
at org.gradle.internal.progress.DefaultBuildOperationExecutor$RunnableBuildOperationWorker.execute(DefaultBuildOperationExecutor.java:336)
at org.gradle.internal.progress.DefaultBuildOperationExecutor$RunnableBuildOperationWorker.execute(DefaultBuildOperationExecutor.java:328)
at org.gradle.internal.progress.DefaultBuildOperationExecutor.execute(DefaultBuildOperationExecutor.java:199)
at org.gradle.internal.progress.DefaultBuildOperationExecutor.run(DefaultBuildOperationExecutor.java:110)
at org.gradle.api.internal.tasks.execution.ExecuteActionsTaskExecuter.executeAction(ExecuteActionsTaskExecuter.java:110)
at org.gradle.api.internal.tasks.execution.ExecuteActionsTaskExecuter.executeActions(ExecuteActionsTaskExecuter.java:92)
... 32 more


gradlew compileDebugSource --stacktrace -info
在AndroidStudio的terminal中输入上面的命令,重新编译查看gradle的具体报错信息
运行如上命令后:

Task :front-core:compileJava FAILED
Putting task artifact state for task ':front-core:compileJava' into context took 0.0 secs.
Up-to-date check for task ':front-core:compileJava' took 0.001 secs. It is not up-to-date because:
Task has failed previously.
All input files are considered out-of-date for incremental task ':front-core:compileJava'.
Compiling with JDK Java compiler API.
警告: [options] 未与 -source 1.7 一起设置引导类路径
/Users/mrq/AndroidStudioProjects/SenseInsight/common/front-core/src/main/java/com/sensetime/insight/front/Visitor.java:25: 警告: @Builder will ignore the initializing expression entirely. If you want the initializing expression to ser as default, add @Builder.Default. If it is not supposed to be settable during building, make the field final.
private int age = -1;
^
/Users/mrq/AndroidStudioProjects/SenseInsight/common/front-core/src/main/java/com/sensetime/insight/front/Visitor.java:30: 警告: @Builder will ignore the initializing expression entirely. If you want the initializing expression to serve as default, add @Builder.Default. If it is not supposed to be settable during building, make the field final.
private String gender = "";
^
/Users/mrq/AndroidStudioProjects/SenseInsight/common/front-core/src/main/java/com/sensetime/insight/front/FaceImage.java:36: 警告: @Builder will ignore the initializing expression entirely. If you want the initializing expression to sve as default, add @Builder.Default. If it is not supposed to be settable during building, make the field final.
private int sended = 0;
^
/Users/mrq/AndroidStudioProjects/SenseInsight/common/front-core/src/main/java/com/sensetime/insight/front/detect/FaceHandler.java:8: 错误: 程序包com.sun.tools.internal.jxc.ap不存在
import com.sun.tools.internal.jxc.ap.Const;
^
1 个错误
3 个警告

:front-core:compileJava (Thread[Task worker for ':',5,main]) completed. Took 1.239 secs.

FAILURE: Build failed with an exception.

* What went wrong:
Execution failed for task ':front-core:compileJava'.
> Compilation failed; see the compiler error output for details.


上面的错误已经很详细了,一个错误,三个警告 警告可以先不用管,直接看错误

/Users/mrq/AndroidStudioProjects/SenseInsight/common/front-core/src/main/java/com/sensetime/insight/front/detect/FaceHandler.java:8: 错误: 程序包com.sun.tools.internal.jxc.ap不存在
import com.sun.tools.internal.jxc.ap.Const;
^


可以直接看出来,哪个路径下的哪个类,出现了什么问题 我的问题是没有找到这个包,然后直接解决就ok了 我相信只要定位到问题,对程序猿来说解决问题就没那么难了吧


其实我的问题是打Constant的时候打错了,自动把Const的包导入了,但是我的AndroidStudio没有设置自动删除无用的包,所以打包的时候出现了这个问题,在这里也晒一下AndroidStudio的自动导包和自动删除包的设置




总数:0 页次:1/0 首页 尾页  
总数:0 页次:1/0 首页 尾页  


该采集也在以下书单中



发表评论:
文本/html模式切换 插入图片 文本/html模式切换


附件:


本帖子属于以下条目(android studio)
android studio 第一次安装教程  
android studio 第一次安装教程

NEWBT官方QQ群1: 276678893
可求档连环画,漫画;询问文本处理大师等软件使用技巧;求档softhub软件下载及使用技巧.
但不可"开车",严禁国家敏感话题,不可求档涉及版权的文档软件.
验证问题说明申请入群原因即可.

Copyright © 2005-2017 clq, All Rights Reserved
CLQ工作室 版权所有